{"text_format":"1","workbook":"xlsx","n_sheets":13,"sheets":["Questions - Farm","Questions - Equipment","Questions - Activities","Timeline","OperationBudget(areaMODELED)","OperationBudget(acre)","PerMODELEDAreaSummary","PerAcreSummary","GHOutput","GHData","MACHCOST2","Factors","DropdownLists"],"not_rendered":{"charts":0,"images":1,"macros":1,"external_links":2,"defined_names":46,"comments":1,"pivot_tables":0},"unopened":[],"bounds":{"document_bytes":16777216,"sheet_cells":100000,"rows_first":2000,"rows_last":500,"rows_between":2000,"halvings":0,"cell_chars":16384,"cell_head_chars":4096},"cells_cut":0,"cells_raw":0,"read":"whole","date_system":"1900"}

{"sheet":"Questions - Farm","index":0,"n_rows":22,"n_cols":6,"rows_kept":22,"cut":false,"hidden":false,"merged":[[18,2,19,5]]}
["Instructions"]
["Click on the \"Open Farm Form\" button to begin submitting information for your operation. Once you have submitted the information, you can edit the cells in blue. Once you are finished, click on the \"Questions - Equipment\" tab at the bottom."]
[]
["Crop Being Modeled: "]
["Production Area this Budget Encompasses: ",null,"feet of 4' bed"]
["Total Area under Cultivation:",null,"acres"]
[]
["Product","Qty Yield ","Units","Price Received per Unit"]
[]
[]
[null,null,null,null,null,"Development of this tool was funded by USDA RMA under award number: RM17RMEPP522C044/4500075419"]
[]
[]
["Cost to own or lease ($ / acre)"]
[]
[null,"Machine Operator","Other"]
["Labor Rates ($/hr)"]
[]
["General Farm Overhead Rate",null,"% of total variable costs; costs that are difficult to assign to an individual crop (e.g. property taxes, office expenses, etc.); this is generally in the 5% to 10% range"]
[]
["Retail Overhead Costs",null,"Enter total retail overhead costs not itemized in the Activities form here"]
["Retail Overhead %",null,"Enter % of Retail Overhead Costs (cell above) that should be assigned to this crop"]

{"sheet":"Questions - Equipment","index":1,"n_rows":27,"n_cols":1,"rows_kept":27,"cut":false,"hidden":false,"merged":[]}
["Instructions"]
["Click the \"Open Equipment Form\" button to begin providing information on your equipment. After submitting, you may edit the blue cells. Red cells are automatically calculated.  To remove a response, click on the \"Delete Column\" button. Once you are finished, click on the \"Questions - Activities\" tab at the bottom."]
[]
[]
[]
["Equipment Used in Production of Seed"]
["Type"]
["List Price "]
["Speed of Implement or Powered Equipment (mph)"]
["Width of Implement or Equipment in Feet"]
["Annual use (estimate) for crop in question (hours)"]
["Fuel Type: "]
["Engine horsepower (hp)"]
["Price of fuel ($ / gallon or kW)"]
["Interest rate on loan used for purchase (if any)"]
["Annual Fuel Costs for Crop"]
["Annual Oil / Lubricant Cost for Crop"]
["Annual Repair Costs for Crop"]
["Total Operating Costs for Crop"]
[]
["Annual Depreciation (straight line) for Crop"]
["Annual Interest Cost for Crop (estimated)"]
["Annual Insurance Estimate for Crop "]
["Total Ownership Costs for Crop"]
[]
[]
["Development of this tool was funded by USDA RMA under award number: RM17RMEPP522C044/4500075419"]

{"sheet":"Questions - Activities","index":2,"n_rows":4,"n_cols":26,"rows_kept":4,"cut":false,"hidden":false,"merged":[[2,18,2,21],[2,22,2,25],[2,4,2,5],[1,0,1,3],[2,8,2,9],[2,10,2,13],[2,14,2,17]]}
["Instructions"]
["Please click the \"Open Form\" button to begin providing information on activity and input costs. If you have a greenhouse and would like to estimate its heating costs, click the \"Open Greenhouse Heating Form\". Fill in the form fields for each production activity. More than one input may be included for a single activity. After completing an activity, please click \"Submit\". Once you have submitted information for all production activities, click \"I'm done\". Responses may be edited by changing the blue cells. If you need to delete an activity you submitted, click the \"Delete Activity Row\" button. "]
[null,null,null,null,"Labor hour estimate",null,"Period Start","Period End ","Area",null,"Input #1 Applied per Area Impacted",null,null,null,"Input #2 Applied per Area Impacted",null,null,null,"Input #3 Applied per Area Impacted",null,null,null,"Input #4 Applied per Area Impacted"]
["Year","Activity Period","Activity Category","Activity Name","Machine Operator Labor (hrs)","Other Labor (hrs)","Date","Date","Impacted","Unit","Name","Qty","Unit","Costs per Unit","Name","Qty","Unit","Costs per Unit","Name","Qty","Unit","Costs per Unit","Name","Qty","Unit","Costs per Unit"]

{"sheet":"Timeline","index":3,"n_rows":4,"n_cols":63,"rows_kept":4,"cut":false,"hidden":false,"merged":[[0,0,2,0],[1,58,1,61],[1,3,1,6],[1,8,1,11],[1,13,1,16],[1,18,1,21],[1,23,1,26],[1,28,1,31],[1,33,1,36],[1,38,1,41],[1,43,1,46],[1,48,1,51],[1,53,1,56]]}
["This timeline is automatically populated by the information provided in the Activities table.",null,null,"2020-01-07","2020-01-14","2020-01-21","2020-01-31",null,"2020-02-07","2020-02-14","2020-02-21","2020-02-28",null,"2020-03-07","2020-03-14","2020-03-21","2020-03-31",null,"2020-04-07","2020-04-14","2020-04-21","2020-04-30",null,"2020-05-07","2020-05-14","2020-05-21","2020-05-31",null,"2020-06-07","2020-06-14","2020-06-21","2020-06-30",null,"2020-07-07","2020-07-14","2020-07-21","2020-07-31",null,"2020-08-07","2020-08-14","2020-08-21","2020-08-31",null,"2020-09-07","2020-09-14","2020-09-21","2020-09-30",null,"2020-10-07","2020-10-14","2020-10-21","2020-10-31",null,"2020-11-07","2020-11-14","2020-11-21","2020-11-30",null,"2020-12-07","2020-12-14","2020-12-21","2020-12-31",1]
[null,"Month",null,"Jan",null,null,null,null,"Feb",null,null,null,null,"Mar",null,null,null,null,"Apr",null,null,null,null,"May",null,null,null,null,"Jun",null,null,null,null,"Jul",null,null,null,null,"Aug",null,null,null,null,"Sep",null,null,null,null,"Oct",null,null,null,null,"Nov",null,null,null,null,"Dec"]
[null,"Week",0,1,2,3,4,0,1,2,3,4,0,1,2,3,4,0,1,2,3,4,0,1,2,3,4,0,1,2,3,4,0,1,2,3,4,0,1,2,3,4,0,1,2,3,4,0,1,2,3,4,0,1,2,3,4,0,1,2,3,4,5]
[null,null,null,0,0,0,0,0,0,0,0,0,0,0,0,0,0,0,0,0,0,0,0,0,0,0,0,0,0,0,0,0,0,0,0,0,0,0,0,0,0,0,0,0,0,0,0,0,0,0,0,0,0,0,0,0,0,0,0,0,0]

{"sheet":"OperationBudget(areaMODELED)","index":4,"n_rows":12,"n_cols":13,"rows_kept":12,"cut":false,"hidden":false,"merged":[[1,4,1,9],[2,2,2,3],[2,4,2,5],[2,6,2,7],[2,8,2,9]]}
["This table is automatically populated using the information "]
["provided in the Farm and Activties questions tabs.",null,null,null,"Costs Per Area Modeled"]
[null,null,"Time Period",null,"Tractor Cost",null,"Equipment Cost",null,"Labor",null,"Input",null,"Total"]
[null,null,"From","To","Variable","Fixed","Variable","Fixed","Hours","Cost","Costs",null,"Costs"]
[null,null,null,null,{"$f":"'OperationBudget(acre)'!E5/VLOOKUP('Questions - Farm'!$C$5,Factors!$K$11:$L$15,2)*'Questions - Farm'!$B$5","v":0},{"$f":"'OperationBudget(acre)'!F5/VLOOKUP('Questions - Farm'!$C$5,Factors!$K$11:$L$15,2)*'Questions - Farm'!$B$5","v":0},{"$f":"'OperationBudget(acre)'!G5/VLOOKUP('Questions - Farm'!$C$5,Factors!$K$11:$L$15,2)*'Questions - Farm'!$B$5","v":0},{"$f":"'OperationBudget(acre)'!H5/VLOOKUP('Questions - Farm'!$C$5,Factors!$K$11:$L$15,2)*'Questions - Farm'!$B$5","v":0},{"$f":"IFERROR('Questions - Activities'!E5+'Questions - Activities'!F5,0)","v":0},{"$f":"'Questions - Activities'!E5*'Questions - Farm'!B17+'Questions - Activities'!F5*'Questions - Farm'!C17","v":0},{"$f":"IFERROR(('Questions - Activities'!L5*'Questions - Activities'!N5+'Questions - Activities'!P5*'Questions - Activities'!R5+'Questions - Activities'!T5*'Questions - Activities'!V5+'Questions - Activities'!X5*'Questions - Activities'!Z5),0)","v":0},null,{"$f":"IFERROR(K5+J5+H5+G5+F5+E5,0)","v":0}]
[null,"Other Equipment Operating Costs:"]
[null,"Machine hours not listed in the above table",null,null,{"$f":"'OperationBudget(acre)'!E7/VLOOKUP('Questions - Farm'!$C$5,Factors!$K$11:$L$15,2)*'Questions - Farm'!$B$5","v":0},null,{"$f":"'OperationBudget(acre)'!G7/VLOOKUP('Questions - Farm'!$C$5,Factors!$K$11:$L$15,2)*'Questions - Farm'!$B$5","v":0},null,null,null,null,null,{"$f":"E7","v":0}]
[null,"Overhead (general)",null,null,{"$f":"SUM(E6:E7)*'Questions - Farm'!$B$19","v":0},null,{"$f":"SUM(G6:G7)*'Questions - Farm'!$B$19","v":0},null,null,{"$f":"SUM(J6:J7)*'Questions - Farm'!$B$19","v":0},{"$f":"SUM(K6:K7)*'Questions - Farm'!$B$19","v":0},null,{"$f":"IFERROR(K8+J8+G8+E8,0)","v":0}]
[null,"Retail Overhead",null,null,null,null,null,null,null,null,null,null,{"$f":"'Questions - Farm'!B21*'Questions - Farm'!B22","v":0}]
[null,"Land Costs",null,null,null,null,null,null,null,null,null,null,{"$f":"('Questions - Farm'!B14/VLOOKUP('Questions - Farm'!C5,Factors!$K$11:$L$15,2))*'Questions - Farm'!$B$5","v":0}]
[null,null,null,null,null,null,null,null,null,null,null,"Total Costs:",{"$f":"SUM(M6:M10)","v":0}]
[null,null,"Development of this tool was funded by USDA RMA under award number: RM17RMEPP522C044/4500075419"]

{"sheet":"OperationBudget(acre)","index":5,"n_rows":4,"n_cols":15,"rows_kept":4,"cut":false,"hidden":false,"merged":[[1,4,1,9],[2,2,2,3],[2,4,2,5],[2,6,2,7],[2,8,2,9]]}
["This table is automatically populated using the information "]
["provided in the Farm, Equipment, and Activties questions tabs.",null,null,null,"Costs Per Acre"]
[null,null,"Time Period",null,"Tractor Cost",null,"Equipment Cost",null,"Labor",null,"Input",null,"Total",null,"convert to acres"]
[null,null,"From","To","Variable","Fixed","Variable","Fixed","Hours","Cost","Costs",null,"Costs"]

{"sheet":"PerMODELEDAreaSummary","index":6,"n_rows":28,"n_cols":7,"rows_kept":28,"cut":false,"hidden":false,"merged":[]}
["This table is created automatically ",null,"Area Modeled: ",{"$f":"+'Questions - Farm'!B5","v":0},{"$f":"+'Questions - Farm'!C5","v":"feet of 4' bed"}]
["using the information provided in the "]
["Equipment and Activities tabs.",null,"Income","Unit","Price/Unit","Quantity","Amount"]
[null,null,"None provided"]
[]
[]
[null,null,null,null,null,"Income Per Area:",{"$f":"SUM(G4:G6)","v":0}]
[]
[null,null,"Variable Expenses"]
[]
[]
[null,null,null,null,null,"Variable Costs Per Area:",{"$f":"SUM(G10:G11)","v":0}]
[]
[null,null,"Fixed Expenses"]
[null,null,"Tractors / Powered Unit","$ per area"]
[null,null,"Implements","$ per area"]
[null,null,"Harvesting Equipment","$ per area"]
[null,null,"Irrigation Equipment","$ per area"]
[null,null,"Post Harvest","$ per area"]
[null,null,"Other","$ per area"]
[null,null,"Land Costs","$ per area"]
[null,null,"General Overhead","$ per area"]
[null,null,"Retail Overhead","$ per area"]
[null,null,null,null,null,"Fixed Costs Per Area:",{"$f":"SUM(G15:G23)","v":0}]
[]
[null,null,null,null,null,"Net Revenues Per Area:",{"$f":"IFERROR(G7-(G12+G24),0)","v":0}]
[]
[null,null,"Development of this tool was funded by USDA RMA under award number: RM17RMEPP522C044/4500075419"]

{"sheet":"PerAcreSummary","index":7,"n_rows":28,"n_cols":7,"rows_kept":28,"cut":false,"hidden":false,"merged":[]}
["This table is created automatically "]
["using the information provided in the "]
["Equipment and Activities tabs.",null,"Income","Unit","Price/Unit","Quantity","Amount"]
[null,null,"None provided"]
[]
[]
[null,null,null,null,null,"Income Per Acre:",{"$f":"SUM(G4:G6)","v":0}]
[]
[null,null,"Variable Expenses"]
[]
[]
[null,null,null,null,null,"Variable Costs Per Acre:",{"$f":"SUM(G10:G11)","v":0}]
[]
[null,null,"Fixed Expenses"]
[null,null,"Tractors / Powered Unit","Acre"]
[null,null,"Implements","Acre"]
[null,null,"Harvesting Equipment","Acre"]
[null,null,"Irrigation Equipment","Acre"]
[null,null,"Post Harvest","Acre"]
[null,null,"Other","Acre"]
[null,null,"Land Costs","Acre"]
[null,null,"General Overhead","Acre"]
[null,null,"Retail Overhead","Acre"]
[null,null,null,null,null,"Fixed Costs Per Acre:",{"$f":"SUM(G15:G22)","v":0}]
[]
[null,null,null,null,null,"Net Revenues Per Acre:",{"$f":"IFERROR(G7-(G12+G24),0)","v":0}]
[]
[null,null,"Development of this tool was funded by USDA RMA under award number: RM17RMEPP522C044/4500075419"]

{"sheet":"GHOutput","index":8,"n_rows":49,"n_cols":9,"rows_kept":49,"cut":false,"hidden":true,"merged":[]}
[]
[]
[null,null,null,null,null,null,"Air Leakage","Value"]
[null,null,null,null,null,null,"A Little",1]
[null,null,null,null,null,null,"Not At All",0.63]
[null,null,"Billings",null,null,null,"Somewhat",1.1879999999999999]
[null,null,"Great Falls",null,null,null,"Very",1.375]
[null,null,"Helena"]
[null,null,"Missoula"]
[]
[]
[]
[]
[]
[]
[]
[]
[]
[]
[null,"Material Drop down options","U-value","(Btu hr F ft2)",null,null,"Fuel Type","Energy (btu)","Unit"]
[null,"Glass",1.1299999999999999,null,null,null,"Fuel Oil #2",138500,"Gallon"]
[null,"Double-layered glass",0.65,null,null,null,"Fuel Oil #4",145000,"Gallon"]
[null,"Fiber glass",1,null,null,null,"Fuel Oil #6",153000,"Gallon"]
[null,"Single polyethylene",1.1499999999999999,null,null,null,"Natural Gas",100000,"Therm"]
[null,"Double polyethylene",0.7,null,null,null,"Propane",92500,"Gallon"]
[null,"Bi-wall polycarbonate",0.65,null,null,null,"Hard Coal",26000000,"Ton"]
[null,"Bi-wall acrylic",0.65,null,null,null,"Soft Coal",24000000,"Ton"]
[null,"Concrete Block",0.51,null,null,null,"Electricity",3412,"kWh"]
[null,"Poured Concrete",0.75,null,null,null,"Methane",1000,"ft3"]
[null,"Insulated Concrete",0.13,null,null,null,"Methanol",57000,"Gallon"]
{"$rows_left_out":20}
{"sheet":"GHData","index":9,"n_rows":1019,"n_cols":14,"rows_kept":1019,"cut":false,"hidden":true,"merged":[]}
[null,null,"This sheet has four data tables, named PrecipitationData, TemperatureData, SunshineData, and WindData"]
[null,null,"Source: National Climatic Data Center"]
[null,null,"284 CITIES"]
[null,null,"Normal Monthly Precipitation (Inches)"]
[null,null,"NORMALS 1971-2000 "]
[]
["City","State","JAN","FEB","MAR","APR","MAY","JUN","JUL","AUG","SEP","OCT","NOV","DEC"]
["ANCHORAGE"," AK",0.68,0.74,0.65,0.52,0.69,1.06,1.7,2.93,2.87,2.08,1.0900000000000001,1.05]
["ANNETTE"," AK",9.67,8.0500000000000007,7.96,7.37,5.73,4.72,4.26,6.12,9.49,13.86,12.21,11.39]
["BARROW"," AK",0.12,0.12,0.09,0.12,0.12,0.32,0.87,1.04,0.69,0.39,0.16,0.12]
["BETHEL"," AK",0.62,0.51,0.67,0.65,0.85,1.6,2.0299999999999998,3.02,2.31,1.43,1.37,1.1200000000000001]
["FAIRBANKS"," AK",0.56000000000000005,0.36,0.28000000000000003,0.21,0.6,1.4,1.73,1.74,1.1200000000000001,0.92,0.68,0.74]
["HOMER"," AK",2.61,2.04,1.82,1.21,1.07,0.96,1.45,2.2799999999999998,3.37,2.77,2.87,3]
["JUNEAU"," AK",4.8099999999999996,4.0199999999999996,3.51,2.96,3.48,3.36,4.1399999999999997,5.37,7.54,8.3000000000000007,5.43,5.41]
["KING SALMON"," AK",1.03,0.72,0.79,0.94,1.35,1.7,2.15,2.89,2.81,2.09,1.54,1.39]
["KODIAK"," AK",8.17,5.72,5.22,5.48,6.31,5.38,4.12,4.4800000000000004,7.84,8.36,6.63,7.64]
["KOTZEBUE"," AK",0.55000000000000004,0.42,0.38,0.41,0.33,0.56999999999999995,1.43,2,1.7,0.95,0.71,0.6]
["MCGRATH"," AK",1.04,0.74,0.81,0.66,1.02,1.45,2.3199999999999998,2.75,2.36,1.46,1.46,1.44]
["NOME"," AK",0.92,0.75,0.6,0.65,0.74,1.1399999999999999,2.15,3.23,2.5099999999999998,1.58,1.28,1.01]
["ST. PAUL ISLAND"," AK",1.74,1.25,1.1200000000000001,1.1200000000000001,1.21,1.41,1.91,2.96,2.79,2.7,2.87,2.13]
["TALKEETNA"," AK",1.45,1.28,1.26,1.22,1.64,2.41,3.24,4.53,4.3499999999999996,3.06,1.78,1.96]
["UNALAKLEET"," AK",0.4,0.31,0.39,0.35,0.55000000000000004,1.25,2.15,2.92,2.1,0.89,0.66,0.47]
["VALDEZ"," AK",6.02,5.53,4.49,3.55,3.08,3.01,3.84,6.62,9.59,8.58,5.51,7.59]
["YAKUTAT"," AK",13.18,10.99,11.41,10.8,9.7799999999999994,7.17,7.88,13.27,20.88,24,15.17,15.85]
["HUNTSVILLE"," AL",5.52,4.95,6.68,4.54,5.24,4.22,4.4000000000000004,3.32,4.29,3.54,5.22,5.59]
["MOBILE"," AL",5.75,5.0999999999999996,7.2,5.0599999999999996,6.1,5.01,6.54,6.2,6.01,3.25,5.41,4.66]
["MONTGOMERY"," AL",5.04,5.45,6.39,4.38,4.1399999999999997,4.13,5.31,3.63,4.22,2.58,4.53,4.97]
["FORT SMITH"," AR",2.37,2.59,3.94,3.91,5.29,4.28,3.19,2.56,3.61,3.94,4.8,3.39]
["LITTLE ROCK"," AR",3.61,3.33,4.88,5.47,5.05,3.95,3.31,2.93,3.71,4.25,5.73,4.71]
["NORTH LITTLE ROCK"," AR",3.37,3.27,4.88,5.03,5.4,3.51,3.15,2.97,3.53,3.81,5.74,4.53]
{"$rows_left_out":990}
{"sheet":"MACHCOST2","index":10,"n_rows":70,"n_cols":8,"rows_kept":70,"cut":false,"hidden":true,"merged":[]}
[]
["Machinery and Equipment Cost Worksheet"]
[null,"Shaded Numbers are Calculated, Others Must be Entered"]
["Development of this tool was funded by USDA RMA under award number: RM17RMEPP522C044/4500075419"]
[]
["CALCULATION OF HOURS OF USE",null,null,null,null,null,"Post Harvest","Power Unit"]
[null,null,"MACHINE NAME OR DESCRIPTION",null,null,null,{"$f":"'Questions - Equipment'!#REF!","v":{"$error":"#REF!"}},{"$f":"'Questions - Equipment'!#REF!","v":{"$error":"#REF!"}}]
["Speed of Implement or Powered Equipment in MPH",null,null,null,null,null,null,{"$f":"'Questions - Equipment'!#REF!","v":{"$error":"#REF!"}}]
["Width of Implement or Equipment in Feet",null,null,null,null,null,null,{"$f":"'Questions - Equipment'!#REF!","v":{"$error":"#REF!"}}]
["Field Efficiency (Enter As a Decimal, 80% as .8) - forced at 80%",null,null,null,null,null,null,0.8]
["    See Factors Page for Guidelines"]
["Total Acres of Annual Use",null,null,null,null,null,null,{"$f":"'Questions - Farm'!$B$6/VLOOKUP('Questions - Farm'!$C$6,Factors!$K$11:$L$15,2)","v":0}]
["    Count Each Pass Over the Same Piece of Ground To Get the"]
["    Total Acres of Annual use."]
[]
["Calculated Hours of Annual Use ",null,null,null,null,null,null,{"$f":"IF(H12=0,0,H12/H17)","v":0}]
["Calculated Acres Per Hour",null,null,null,null,null,null,{"$f":"H8*H9*(IF(H10<1,100*H10,H10))/825","v":{"$error":"#REF!"}}]
["Basic Information For Cost Calculations"]
["List Price",null,null,null,null,null,{"$f":"'Questions - Equipment'!#REF!","v":{"$error":"#REF!"}},{"$f":"'Questions - Equipment'!#REF!","v":{"$error":"#REF!"}}]
["Annual Use in Hours for Budget in question",null,null,null,null,null,{"$f":"'Questions - Equipment'!#REF!","v":{"$error":"#REF!"}},{"$f":"'Questions - Equipment'!#REF!","v":{"$error":"#REF!"}}]
["Estimated Life in Hours",null,null,null,null,null,12000,12000]
["Salvage Value - forced at 10% of list",null,null,null,null,null,{"$f":"G19*0.1","v":{"$error":"#REF!"}},{"$error":"#REF!"}]
["OPERATING COSTS:"]
["FUEL:"]
["   Fuel Factor (Diesel = .044, Gas = .06, LP = .072)",null,null,null,null,null,{"$f":"IFERROR(VLOOKUP('Questions - Equipment'!#REF!,DropdownLists!$E$2:$F$5,2),0)","v":0},{"$f":"IFERROR(VLOOKUP('Questions - Equipment'!#REF!,DropdownLists!$E$2:$F$5,2),0)","v":0}]
["   Horse Power",null,null,null,null,null,{"$f":"'Questions - Equipment'!#REF!","v":{"$error":"#REF!"}},{"$f":"'Questions - Equipment'!#REF!","v":{"$error":"#REF!"}}]
["   Price Per Gallon of Fuel",null,null,null,null,null,{"$f":"'Questions - Equipment'!#REF!","v":{"$error":"#REF!"}},{"$f":"'Questions - Equipment'!#REF!","v":{"$error":"#REF!"}}]
["   Calcualted Gallons or Kw Per Hour Used",null,null,null,null,null,{"$f":"G25*G26","v":{"$error":"#REF!"}},{"$error":"#REF!"}]
["      Total Fuel Costs",null,null,null,null,null,{"$f":"G28*G27*G20","v":{"$error":"#REF!"}},{"$error":"#REF!"}]
["ENGINE OIL AND OTHER LUBRICANTS:",null,null,null,null,null,{"$f":"0.15*G29","v":{"$error":"#REF!"}},{"$error":"#REF!"}]
{"$rows_left_out":41}
{"sheet":"Factors","index":11,"n_rows":112,"n_cols":13,"rows_kept":112,"cut":false,"hidden":true,"merged":[]}
[]
["The following table contains a guide for machinery"]
["repair factors and hours of useful life for farm machinery."]
["These factors are required input in this template"]
["and were derived from several years of Nebraska tractor"]
["test data."]
[]
[null,null,null,null,"Useful",null,"Repair"]
[null,null,null,null,"Life",null,"Cost",null,null,null,null,"Sqft/acre",43560]
["Machine",null,null,null,"Hours",null,"Factor",null,null,null,null,"Conversion to acres","Sq.ft."]
["ATV",null,null,null,12000,null,0.5,null,null,null,"acres",{"$f":"$M$9/M11","v":1},43560]
["Baler with Engine",null,null,null,2500,null,0.6,null,null,null,"feet of 3' bed",{"$f":"$M$9/M12","v":14520},3]
["Baler, PTO",null,null,null,2500,null,0.8,null,null,null,"feet of 4' bed",10890,4]
["Blower, Ensilage",null,null,null,2000,null,0.8,null,null,null,"feet of 5' bed",8712,5]
["Combine, PTO",null,null,null,2000,null,1,null,null,null,"sq. ft. ",43560,1]
["Combine, Self-Propelled",null,null,null,2000,null,0.6]
["Corn Head",null,null,null,2000,null,1]
["Corn Picker",null,null,null,2000,null,0.8]
["Cutter, Rotary",null,null,null,2000,null,0.6]
["Cutter, Stalk",null,null,null,2000,null,0.6]
["Fertilizer Equipment, Dry",null,null,null,1200,null,1.2]
["Fertilizer Equipment, Liquid",null,null,null,1200,null,1.2]
["Floats and Scrapers",null,null,null,2500,null,0.6]
["Harvester, Flail",null,null,null,2000,null,0.8]
["Harvester, Forage, Pull-Type",null,null,null,2000,null,0.8]
["Harvester, Forage, Self-Propelled",null,null,null,2000,null,0.6]
["Harvester, Potato",null,null,null,2500,null,0.8]
["Harvester, Sugar Beet",null,null,null,2500,null,0.8]
["Hay Conditioner",null,null,null,2500,null,1]
["Land Plane",null,null,null,2500,null,0.6]
{"$rows_left_out":83}
{"sheet":"DropdownLists","index":12,"n_rows":66,"n_cols":15,"rows_kept":66,"cut":false,"hidden":true,"merged":[]}
["Area","Index","PowerUnits","Implements:","Fuel","factor",null,null,"Units",null,"Water","Irrigation Type","Operating Cost / AF","Ownership Cost / Acre; annualized"]
["acres",1,"Stationary, Power Unit","  Bed sled or shaper","Diesel",4.3999999999999997E-2,null,null,"tons",null,"Acre-Feet","Center Pivot",144,42,"same as WL"]
["feet of 3' bed",2,"Tractor, 2 Wheel Drive","  Chisel plow","Electric",0.74570000000000003,null,null,"pounds",null,"Acre-Inch","Drip",144,480,"Pepper, UCD"]
["feet of 4' bed",3,"Tractor, 4 Wheel Drive","  Fertilizer spreader, pull type","Gas",0.06,null,null,"seeds",null,null,"Flood",{"$f":"12*12","v":144},38,"Alfalfa, UCD"]
["feet of 5' bed",4,"Tractor, Crawler","  Field cultivator","Liquid Propane",7.1999999999999995E-2,null,null,"packets",null,null,"Micro-Spray",144,480,"assumed same as drip"]
["sq. ft. ",5,"Combine, PTO","  Grain drill",null,null,null,null,null,null,null,"Solid Set Sprinkler",144,85,"OSU, carrot"]
[null,6,"Combine, Self-Propelled","  Harrow -- Single disk",null,null,null,null,null,null,null,"Wheel Line",144,42,"Almond, UCD"]
[null,7,"Swather, Self-Propelled","Land Plane"]
[null,8,"Wagon and Box","  Lister"]
[null,9,"Corn Head","  Moldboard or disk plow"]
[null,10,"Corn Picker","  Offset or heavy tandem disk"]
[null,null,"Cutter, Rotary","  One-way disk, 3-5 in. depth"]
[null,null,"Cutter, Stalk","  Powered rotary tiller"]
[null,null,"Fertilizer Equipment, Dry","  Rod weeder"]
[null,null,"Fertilizer Equipment, Liquid","  Roller or packer (cultipacker)"]
[null,null,"Floats and Scrapers","  Rotary hoe"]
[null,null,"Harvester, Flail","  Row crop cultivator - deep"]
[null,null,"Harvester, Potato","  Row crop cultivator - shallow"]
[null,null,"Harvester, Sugar Beet","  Spike tooth harrow"]
[null,null,"Hay Conditioner","  Sprayer"]
[null,null,"Land Plane","  Spring Tooth harrow"]
[null,null,"Loader, Ensilage","  Subsoiler"]
[null,null,"Loader, Front End","  Tandem disk"]
[null,null,"Manure Spreader","  Unpowered rotary cultivator"]
[null,null,"Mower","Seed Drill"]
[null,null,"Rake, Side Delivery"]
[null,null,"Seeding Equipment","Harvesting:"]
[null,null,"Sprayers, Mounted","  Bale-loader-stacker"]
[null,null,"Tillage Tools","  Baler"]
[null,null,"Truck, Feed","  Beet harvester"]
{"$rows_left_out":36}